{"text_format":"3","workbook":"xlsx","n_sheets":6,"sheets":["Transfer Document","Account Descriptions","Categorical Guidelines","Sheet2","RTBA","AC"],"not_rendered":{"images":1,"defined_names":10,"comments":1},"read":"whole","date_system":"1900"}

{"sheet":"Transfer Document","index":0,"n_rows":110,"n_cols":11,"rows_kept":110,"merged":[[0,0,0,10],[1,0,1,10],[2,0,2,10],[3,0,3,10],[6,1,6,10],[7,1,7,10],[8,0,8,10],[9,0,9,10],[10,0,10,10],[11,0,11,10],[12,0,12,1],[12,2,12,3],[12,5,12,6],[12,7,12,8],[12,9,12,10],[13,0,13,1],[13,2,13,6],[13,9,13,10],[14,0,14,3],[14,4,14,6],[15,0,15,3],[15,4,15,6],[16,0,16,10],[17,0,17,10],[18,1,18,2],[18,4,18,10],[19,1,19,2],[19,4,19,10],[20,1,20,2],[20,4,20,10],[21,1,21,2],[21,4,21,10],[22,1,22,2],[22,4,22,10],[23,1,23,2],[23,4,23,10],[24,1,24,2],[24,4,24,10],[25,1,25,2],[25,4,25,10],[26,1,26,2],[26,4,26,10],[27,0,27,10],[28,0,28,10],[29,1,29,10],[30,1,30,10],[31,1,31,3],[31,4,31,10],[32,0,32,3],[32,4,32,10],[33,0,33,10],[34,8,34,10],[47,8,48,8],[47,9,48,9],[47,10,48,10],[61,8,62,8],[61,9,62,9],[61,10,62,10],[71,1,71,10],[72,4,72,6],[73,1,73,10],[74,1,74,10],[75,1,75,10],[78,0,78,10],[80,1,80,3],[80,7,80,9],[81,1,81,4],[81,7,81,10],[82,1,82,3],[82,7,82,9],[84,1,84,3],[84,7,84,9],[85,1,85,4],[85,7,85,10],[86,1,86,3],[86,7,86,9],[89,1,89,3],[89,7,89,9],[90,1,90,4],[90,7,90,10],[91,1,91,4],[91,7,91,10],[93,6,93,7],[95,2,95,10],[96,0,96,10],[97,0,97,10],[98,1,98,3],[98,7,98,9],[99,1,99,5],[99,7,99,10],[103,0,103,10],[104,0,104,2],[109,0,109,10]]}
["Major Categorical Funds"]
["Justification of Expenditure for Budget/Expense Transfer"]
["and SPSA Modification"]
["2018-19"]
[]
["Complete this form for the following change in categorical expenditures allocated in the 2018-19 SPSA:"]
[null,"BUDGET transfer within a categorical resource."]
[null,"EXPENSE transfer between and/or into categorical resources.  Budget Transaction Detail Report or Actuals Query  is required highlighting items to transfer."]
[]
["A copy of the SSC meeting minutes showing budget discussion item must be attached."]
["(Minutes must include resource, account, and amounts for both “from” and “to” and the description of the resulting benefit to students)."]
[]
["School Name:",null,{"$f":"VLOOKUP(J13,RTBA!B:C,2,FALSE)","v":"Elementary/Interim"},null,"Date:      ",null,null,"Location Number:",null,"0001"]
["Analyst:",null,{"$f":"VLOOKUP(J13,RTBA!B:I,8,FALSE)","v":""},{"$nulls":4},"Resource Teacher:",null,{"$f":"VLOOKUP(J13,RTBA!B:E,4,FALSE)","v":""}]
["Proposed Funding Resource:"]
["PAR Number (If Required): "]
["Description of Proposed Expenditure:  All expenditures should be listed individually"]
["Expenditure and Benefit to Students and/or Parent Involvement:  How is the money specifically being spent on students?  How will this affect student achievement?  Please explain your rationale for compliance for the use of categorical funds."]
[null,"Focus Area",null,"Account","Rationale"]
["Example","Closing the Gap",null,1157,"After school math tutoring for upper grade students identified by teachers using current math assessments."]
["A."]
["B."]
["C."]
["D."]
["E."]
["F."]
["G."]
["* Please list amount funded for each item on the following budget page."]
["Reason for Transfer:"]
[null,"Increase to an activity previously identified in SPSA:  "]
[null,"Transfer of expenditures due to clerical error:  "]
[null,"Other (Please specify):  "]
["Required SPSA Modification:"]
["Data used to Justify Expenditure:"]
[null,"CAASP",null,"ELPAC",null,"Other (Please Specify) "]
[null,"DRA2",null,"Benchmarks"]
[]
[]
["FROM:","Dept.","Resource","Budget Ref","Account","Program","Class","Fund","Extended","Amount","Description"]
["Example","0001","30100","00",5735,1000,"1110","01000","0000",{"v":2500,"d":"$2,500.00"},{"$f":"IFERROR(VLOOKUP(E40,AC!B:C,2,FALSE),\"\")","v":"Interprogram Svcs/Field Trip"}]
["A.",{"$f":"IF($J13>0,$J13,\"\")","v":"0001"},"     ","00","     ",null,"     ","01000","0000","$     ",{"$f":"IFERROR(VLOOKUP(E41,AC!B:C,2,FALSE),\"\")","v":""}]
["B.",{"$f":"IF($J13>0,$J13,\"\")","v":"0001"},"     ","00","     ","     ","     ","01000","0000","$     ",{"$f":"IFERROR(VLOOKUP(E42,AC!B:C,2,FALSE),\"\")","v":""}]
["C.",{"$f":"IF($J13>0,$J13,\"\")","v":"0001"},"     ","00","     ","     ","     ","01000","0000","$     ",{"$f":"IFERROR(VLOOKUP(E43,AC!B:C,2,FALSE),\"\")","v":""}]
["D.",{"$f":"IF($J13>0,$J13,\"\")","v":"0001"},"     ","00","     ","     ","     ","01000","0000","$     ",{"$f":"IFERROR(VLOOKUP(E44,AC!B:C,2,FALSE),\"\")","v":""}]
["E.",{"$f":"IF($J13>0,$J13,\"\")","v":"0001"},"     ","00","     ","     ","     ","01000","0000","$     ",{"$f":"IFERROR(VLOOKUP(E45,AC!B:C,2,FALSE),\"\")","v":""}]
["F.",{"$f":"IF($J13>0,$J13,\"\")","v":"0001"},"     ","00","     ","     ","     ","01000","0000","$     ",{"$f":"IFERROR(VLOOKUP(E46,AC!B:C,2,FALSE),\"\")","v":""}]
["G.",{"$f":"IF($J13>0,$J13,\"\")","v":"0001"},"     ","00","     ","     ","     ","01000","0000","$     ",{"$f":"IFERROR(VLOOKUP(E47,AC!B:C,2,FALSE),\"\")","v":""}]
[{"$nulls":8},"Total",{"$f":"SUM(J41:J47)","v":0}]
[]
[]
[]
[]
["TO:","Dept.","Resource","Budget Ref","Account","Program","Class","Fund","Extended","Amount","Description"]
["Example","0001","30100","00",1157,1000,"1110","01000","0000",{"v":2500,"d":"$2,500.00"},{"$f":"IFERROR(VLOOKUP(E54,AC!B:C,2,FALSE),\"\")","v":"Classroom Teacher Hrly"}]
["A.",{"$f":"IF($J13>0,$J13,\"\")","v":"0001"},"     ","00",{"$f":"D21","v":0},"     ","     ","01000","0000","$     ",{"$f":"IFERROR(VLOOKUP(E55,AC!B:C,2,FALSE),\"\")","v":"All Accounts"}]
["B.",{"$f":"IF($J13>0,$J13,\"\")","v":"0001"},"     ","00",{"$f":"D22","v":0},"     ","     ","01000","0000","$     ",{"$f":"IFERROR(VLOOKUP(E56,AC!B:C,2,FALSE),\"\")","v":"All Accounts"}]
["C.",{"$f":"IF($J13>0,$J13,\"\")","v":"0001"},"     ","00",{"$f":"D23","v":0},"     ","     ","01000","0000","$     ",{"$f":"IFERROR(VLOOKUP(E57,AC!B:C,2,FALSE),\"\")","v":"All Accounts"}]
["D.",{"$f":"IF($J13>0,$J13,\"\")","v":"0001"},"     ","00",0,"     ","     ","01000","0000","$     ",{"$f":"IFERROR(VLOOKUP(E58,AC!B:C,2,FALSE),\"\")","v":"All Accounts"}]
["E.",{"$f":"IF($J13>0,$J13,\"\")","v":"0001"},"     ","00",0,"     ","     ","01000","0000","$     ",{"$f":"IFERROR(VLOOKUP(E59,AC!B:C,2,FALSE),\"\")","v":"All Accounts"}]
["F.",{"$f":"IF($J13>0,$J13,\"\")","v":"0001"},"     ","00",0,"     ","     ","01000","0000","$     ",{"$f":"IFERROR(VLOOKUP(E60,AC!B:C,2,FALSE),\"\")","v":"All Accounts"}]
["G.",{"$f":"IF($J13>0,$J13,\"\")","v":"0001"},"     ","00",0,"     ","     ","01000","0000","$     ",{"$f":"IFERROR(VLOOKUP(E61,AC!B:C,2,FALSE),\"\")","v":"All Accounts"}]
[{"$nulls":8},"Total",{"$f":"SUM(J55:J61)","v":0}]
{"$rows_empty":8}
["Site Assurances:"]
[null,"Student achievement data and site plan strategies were reviewed and analyzed.  Based on our findings, the SSC has approved modifying our Single Plan for Student Achievement (SPSA) and categorical budget."]
[null,"List date(s) of SSC meeting(s):"]
[null,"A copy of the SSC meeting minutes showing plan and budget discussion item is attached, and discussion/approval item is highlighted (Includes resource, account, and amounts)."]
[null,"A copy of the Detailed Transaction Report is attached and highlighted or actuals query (expense transfers only)."]
[null,"The expense(s) is/are supplemental to district-provided services."]
[]
["Required Signatures:"]
["The undersigned declare under penalty of perjury that the foregoing is true and correct and that these assurances were signed in San Diego, California, on the date(s) indicated."]
[]
[]
[null,"_____________________________________",{"$nulls":5},"_______________________________________________"]
[null,"Principal (Print Name)",null,null,"Date",null,null,"SSC Chairperson (Print Name)",null,null,"Date"]
[]
[]
[null,"_____________________________________",{"$nulls":5},"_______________________________________________"]
[null,"Principal's Signature",null,null,"Date",null,null,"SSC Chairperson's Signature",null,null,"Date"]
{"$rows_left_out":24}
{"sheet":"Account Descriptions","index":1,"n_rows":1140,"n_cols":2,"rows_kept":1140}
["Account","Long Descr"]
["0000","All Accounts"]
["0341","SD Millennial Tech Magnet"]
["1000","Certificated Salaries"]
["1100","Teachers'  Salaries"]
["1101","Teacher/Childrens Center"]
["1103","Teacher/Clsrm/Preschool"]
["1107","Classroom Teacher"]
["1109","Pull/Out Push In"]
["1113","Teacher/Clsrm/GATE"]
["1114","Enrollment Reserve"]
["1118","Prep Time Teacher Allocation"]
["1128","Resource Specialist"]
["1132","Master/Lead Teacher"]
["1136","Lv of Absence NonPay Status"]
["1147","Clsrm Cert Salry Undist Contra"]
["1150","Teacher Asst/Clsrm/Hrly"]
["1151","Teacher/Childrens Ctr/Hrly"]
["1152","Extended Day Pay Per Unit"]
["1153","Tchr/Clsrm/Preschool/Hrly"]
["1154","Enrollment Reserve"]
["1157","Classroom Teacher Hrly"]
["1158","Techer/Clsrm/Ext Day/ROTC"]
["1159","PullOut/Push in Hrly"]
["1160","Student Teacher Supv"]
["1161","Sub In Lieu of Overformula"]
["1162","Short Term Leave Visiting Tchr"]
["1163","Long Term Leave Visiting Tchr"]
["1164","Teacher/ClsrmSuper/Hrly"]
["1165","Jury & Berevmnt Visiting Tchr"]
["1168","Tchr/Elem/PrepTime/Hrly"]
["1170","Prof&Curriclm DevHrlyClsrmTchr"]
["1171","Hourly Tutorial Assignment"]
["1178","Resource Specialist Hrly"]
["1182","Master Lead Tchr/Hrly"]
["1186","Other Cert/Ret/Consultant/Cl"]
["1187","Adult Ed/Hrly"]
["1189","Retired Clsrm Teacher Hrly"]
["1192","Prof&Curriclm Dev Vist Tchr"]
["1197","Clsrm Cert Hrly Undist/Contra"]
["1200","Certificated Pupil Support Sal"]
["1201","Librarian"]
["1202","Principal/Special Assign/Cert"]
["1203","Vice-Principal/School Site"]
["1204","Vice Principal/Spec Assign/Cer"]
["1206","OCILE Administrator"]
["1208","Charter School Admin/Cert"]
["1210","Counselor"]
["1220","Psychologist"]
["1230","Audiologist/Audiometrist"]
["1240","Nurse"]
["1251","Librarian Hrly"]
["1253","Vice-Principal/Sch. Site/Hrly"]
["1258","Charter School/Admin/Hrly"]
["1260","Counselor Hrly"]
["1262","Nurse/Counslr/Psychologist Sub"]
["1270","Psychologist Hrly"]
["1280","Audiologist/Audiometrist Hrly"]
["1290","Nurse Hrly"]
["1300","Cert Super and Admin Sal"]
["1301","Superintendent"]
["1302","Chief SIO/Depty Superintdnt"]
["1303","Coordinator/Cert"]
["1305","Chief/Exec/Dir/Admin (Rep)"]
["1306","Chief/Exec/Dir/Admin(Non-Rep)"]
["1307","Assistant Director/Cert"]
["1308","School Principal"]
["1309","Vice-Principal"]
["1311","Manager"]
["1313","Other Admin Cert"]
["1315","Admin On Special Assignment"]
["1321","Director"]
["1358","Principal Hrly"]
["1359","Vice-Principal Hrly"]
["1361","Manager/Admin Hrly"]
["1363","Administrator/Cert/Hrl"]
["1365","Admin/Spec Assign/Hrly"]
["1386","Retired Admin Hrly"]
["1401","Librarian/Cert"]
["1451","Librarian/Cert/Hrly"]
{"$rows_left_out":1061}
{"sheet":"Categorical Guidelines","index":2,"n_rows":30,"n_cols":4,"rows_kept":30,"merged":[[1,0,24,0],[1,1,24,1],[19,3,24,3],[25,0,29,0],[25,1,29,1],[25,3,29,3]]}
["Resource","Resource Description","Sample Allowable Expenses","Sample Non-Allowable Expenses"]
[30100,"Title I Basic","·        Equipment –directly related to support student achievement in the Common Core State Standards.","·     Administrative Positions including Vice Principals and Dean of Students"]
[null,null,"·        Instructional and Intervention materials above the core","·     Clerical positions"]
[null,null,"·        Travel for professional development (must be pre-approved).","·     Network Tech-unless working directly with students on intervention programs and/or activities."]
[null,null,"·        Conferences for professional development. ","·     Non-academic field trips"]
[null,null,"·        Field Trips (in support of common core instruction).","·     Copier contract"]
[null,null,"·        Substitutes to provide release time for professional development (for classroom teachers).","·     Campus Security/ Noon Duty"]
[null,null,"·        Parent Involvement","·     Meals"]
[null,null,"·        Extended Day/Year Programs","·     Athletic equipment"]
[null,null,"·        Additional FTE above district allocation including:","·     Medical supplies"]
[null,null,"­    Nurse","·      Custodial supplies"]
[null,null,"­    Counselor","·     Building improvement"]
[null,null,"­    AVID teachers and tutors","·     Incentives"]
[null,null,"­    Class size reduction teachers"]
[null,null,"­    Push-in Instruction teacher"]
[null,null,"­    Subject-specific resource teachers"]
[null,null,"­    Classroom teachers who provide qualitatively different instruction to underperforming students."]
[null,null,"­    Prep teachers (only if used to release teachers for professional development)."]
[null,null,"­    Parent Academic Liaison"]
[null,null,"·        Hourly time including:"]
[null,null,"­    Classroom teachers and classified staff working directly in supplemental services and/or programs for students "]
[null,null,"­    Nursing Time"]
[null,null,"­    Counselor Time"]
[null,null,"·        Pupil Advocate"]
[null,null,"·        Assistants (guidance, classroom, library, etc.) If working directly with students on intervention programs or activities. This MUST be clearly articulated in the SPSA."]
[30103,"Title I Parent Involvement","·     Materials for parent meetings and training","·     Same as for Title I Basic."]
[null,null,"·     Conferences and workshops for parents"]
[null,null,"·     Presentations for educational programs to parents or consultants"]
[null,null,"·     Parent communication materials"]
[null,null,"·     Light refreshments.  (Meals are not allowable)"]

{"sheet":"Sheet2","index":3,"n_rows":5,"n_cols":1,"rows_kept":5,"hidden":true}
["Maximizing Instructional Time"]
["Closing the Gap"]
["Professional Development"]
["Socio-Emotional Supports"]
["Parent Engagement"]

{"sheet":"RTBA","index":4,"n_rows":1343,"n_cols":11,"rows_kept":1343,"hidden":true}
["DeptID",null,"Long Description","RT","RT1","RT3","RT4","BA","BA 2","BA3","BA4"]
[0,"0000","All Cost Centers Combined",0,"","MJ","Mary Johnson: 619-725-5611",0,"","TL","Tom Liberto: 619-725-7093"]
[1,"0001","Elementary/Interim",0,"","DG","Dario Gutierrez: 619-725-7785",0,"","SK","Sarah Kidder: 619-725-7413"]
[2,"0002","Elementary/Personnel",0,"",null,null,0,"","HS","Harry Sullivan: 619-725-7624"]
[3,"0003","Adams Elementary","MJ","Mary Johnson: 619-725-5611",null,null,"BG","Bich Ha Groll: 619-725-7788","BG2","Bernize Gil: 619-725-7633"]
[4,"0004","Alcott Elementary","DG","Dario Gutierrez: 619-725-7785",null,null,"TJ","Tammy Jackson: 619-725-7640","BG","Bich Ha Groll: 619-725-7788"]
[5,"0005","Andersen Elementary",0,"",null,null,0,"","DA","Dawn Ahlers: 619-725-7621"]
[6,"0006","Adams Annex",0,"",null,null,0,"","DG","Debbie Glanz: 619-725-7619"]
[7,"0007","Angier Elementary","DG","Dario Gutierrez: 619-725-7785",null,null,"GS","Gustav Swanson: 619-725-7616","GY","Gordon Yorke: 619-725-7643"]
[8,"0008","Audeo",0,"",null,null,0,"","GS","Gustav Swanson: 619-725-7616"]
[9,"0009","Audubon K-8","DG","Dario Gutierrez: 619-725-7785",null,null,"RC","Rita Clegg: 619-725-7644","JC","Jeffrey Clemons: 619-725-7783"]
[10,"0010","e3 Civic High",0,"",null,null,0,"","JM2","Jennifer Marrone (858-627-7332)"]
[11,"0011","Baker Elementary","DG","Dario Gutierrez: 619-725-7785",null,null,"JC","Jeffrey Clemons: 619-725-7783","JM3","Joy Milus: 619-725-7787"]
[12,"0012","Balboa Park Program",0,"",null,null,0,"","LP","Lilibeth Puentespina: 619-725-7660"]
[13,"0013","Balboa Elementary","DG","Dario Gutierrez: 619-725-7785",null,null,"JC","Jeffrey Clemons: 619-725-7783","LB","Linda Balvaneda: 619-725-7660"]
[14,"0014","Old Town Academy K-8 Charter",0,"",null,null,0,"","MH","Maurice Hernandez: 619-725-7647"]
[15,"0015","Bandini Elementary",0,"",null,null,0,"","MS","Michelle Speegle: 619-725-7634"]
[16,"0016","Elevate Elementary CS",0,"",null,null,0,"","PH","Paula Hall: 619-725-7639"]
[17,"0017","Barnard Elementary","DG","Dario Gutierrez: 619-725-7785",null,null,"JM3","Joy Milus: 619-725-7787","RC","Rita Clegg: 619-725-7644"]
[18,"0018","Learning Choice Academy",0,"",null,null,0,"","TJ","Tammy Jackson: 619-725-7640"]
[19,"0019","Linda Vista Annex",0,"",null,null,0,"","TV","Tania Valero: 619-725-7638"]
[21,"0021","Bay Park Elementary","DG","Dario Gutierrez: 619-725-7785",null,null,"TJ","Tammy Jackson: 619-725-7640","TR","Tenya Rushing: 619-725-7637"]
[22,"0022","High Tech Elementary",0,"",null,null,0,"","NR","Not Required"]
[23,"0023","Bayview Terrace Elementary",0,"",null,null,0,""]
[24,"0024","Ingenuity Charter School",0,"",null,null,0,""]
[25,"0025","Beale Elementary",0,"",null,null,0,""]
[26,"0026","King-Chavez Arts Academy",0,"",null,null,0,""]
[27,"0027","Benchley",0,"",null,null,0,""]
[28,"0028","Thrive Public School",0,"",null,null,0,""]
[29,"0029","Bird Rock Elementary","MJ","Mary Johnson: 619-725-5611",null,null,"RC","Rita Clegg: 619-725-7644"]
[31,"0031","Birney Elementary","MJ","Mary Johnson: 619-725-5611",null,null,"GY","Gordon Yorke: 619-725-7643"]
[33,"0033","Boone Elementary","DG","Dario Gutierrez: 619-725-7785",null,null,"RC","Rita Clegg: 619-725-7644"]
[35,"0035","Breen",0,"",null,null,0,""]
[37,"0037","Brooklyn Elementary",0,"",null,null,0,""]
[39,"0039","Burbank Elementary","MJ","Mary Johnson: 619-725-5611",null,null,"PH","Paula Hall: 619-725-7639"]
[41,"0041","Cabrillo Elementary","DG","Dario Gutierrez: 619-725-7785",null,null,"JM3","Joy Milus: 619-725-7787"]
[43,"0043","Cadman Elementary","DG","Dario Gutierrez: 619-725-7785",null,null,"TJ","Tammy Jackson: 619-725-7640"]
[44,"0044","King-Chavez Primary Academy",0,"",null,null,0,""]
[45,"0045","Camp Cuyamaca",0,"",null,null,0,""]
[47,"0047","Camp Denver C. Fox",0,"",null,null,0,""]
[49,"0049","Camp Maston",0,"",null,null,0,""]
[51,"0051","Camp Palomar",0,"",null,null,0,""]
[52,"0052","Jola Community Charter",0,"",null,null,0,""]
[55,"0055","Carson Elementary","DG","Dario Gutierrez: 619-725-7785",null,null,"GS","Gustav Swanson: 619-725-7616"]
[56,"0056","Childrens Conservation Academy",0,"",null,null,0,""]
[57,"0057","Carver Elementary","MJ","Mary Johnson: 619-725-5611",null,null,"LP","Lilibeth Puentespina: 619-725-7660"]
[58,"0058","Central/Cal-Trans Project",0,"",null,null,0,""]
[59,"0059","Central Elementary","MJ","Mary Johnson: 619-725-5611",null,null,"BG","Bich Ha Groll: 619-725-7788"]
[60,"0060","Chavez Elementary","DG","Dario Gutierrez: 619-725-7785",null,null,"JC","Jeffrey Clemons: 619-725-7783"]
[61,"0061","Chesterton Elementary","DG","Dario Gutierrez: 619-725-7785",null,null,"GS","Gustav Swanson: 619-725-7616"]
[62,"0062","Cherokee Point Elementary","MJ","Mary Johnson: 619-725-5611",null,null,"BG","Bich Ha Groll: 619-725-7788"]
[63,"0063","Chollas/Mead Elementary","DG","Dario Gutierrez: 619-725-7785",null,null,"JC","Jeffrey Clemons: 619-725-7783"]
[65,"0065","Clay Elementary","MJ","Mary Johnson: 619-725-5611",null,null,"LP","Lilibeth Puentespina: 619-725-7660"]
[66,"0066","Civita Property",0,"",null,null,0,""]
[67,"0067","Cleveland Elementary",0,"",null,null,0,""]
[68,"0068","King-Chavez Athletics Academy",0,"",null,null,0,""]
[71,"0071","Crocket Site",0,"",null,null,0,""]
[73,"0073","Crown Point Elementary","DG","Dario Gutierrez: 619-725-7785",null,null,"JM3","Joy Milus: 619-725-7787"]
[74,"0074","Iftin Charter",0,"",null,null,0,""]
[75,"0075","Cubberley Elementary","DG","Dario Gutierrez: 619-725-7785",null,null,"GS","Gustav Swanson: 619-725-7616"]
[76,"0076","Magnolia Science Academy",0,"",null,null,0,""]
[77,"0077","Curie Elementary","DG","Dario Gutierrez: 619-725-7785",null,null,"HS","Harry Sullivan: 619-725-7624"]
[78,"0078","Dailard Elementary","MJ","Mary Johnson: 619-725-5611",null,null,"TJ","Tammy Jackson: 619-725-7640"]
[79,"0079","Darnall E-Charter",0,"",null,null,0,""]
[80,"0080","Dana","DG","Dario Gutierrez: 619-725-7785",null,null,"JM3","Joy Milus: 619-725-7787"]
[82,"0082","King-Chavez Preparatory",0,"",null,null,0,""]
[83,"0083","Decatur Elementary",0,"",null,null,0,""]
[85,"0085","Dewey Elementary","DG","Dario Gutierrez: 619-725-7785",null,null,"JM3","Joy Milus: 619-725-7787"]
[86,"0086","Dingeman Elementary","MJ","Mary Johnson: 619-725-5611",null,null,"HS","Harry Sullivan: 619-725-7624"]
[87,"0087","Doyle Elementary","DG","Dario Gutierrez: 619-725-7785",null,null,"HS","Harry Sullivan: 619-725-7624"]
[89,"0089","Edison Elementary","MJ","Mary Johnson: 619-725-5611",null,null,"BG","Bich Ha Groll: 619-725-7788"]
[90,"0090","Scripps Elementary","MJ","Mary Johnson: 619-725-5611",null,null,"HS","Harry Sullivan: 619-725-7624"]
[91,"0091","Emerson/Bandini Elementary","MJ","Mary Johnson: 619-725-5611",null,null,"GY","Gordon Yorke: 619-725-7643"]
[92,"0092","Einstein Academy",0,"",null,null,0,""]
[93,"0093","Encanto Elementary","DG","Dario Gutierrez: 619-725-7785",null,null,"JC","Jeffrey Clemons: 619-725-7783"]
[95,"0095","Euclid Elementary","MJ","Mary Johnson: 619-725-5611",null,null,"LP","Lilibeth Puentespina: 619-725-7660"]
[99,"0099","Farnum Center-Site Demolished",0,"",null,null,0,""]
[103,"0103","Field Elementary","MJ","Mary Johnson: 619-725-5611",null,null,"MS","Michelle Speegle: 619-725-7634"]
[105,"0105","Fletcher Elementary","DG","Dario Gutierrez: 619-725-7785",null,null,"GS","Gustav Swanson: 619-725-7616"]
[107,"0107","Florence Elementary","MJ","Mary Johnson: 619-725-5611",null,null,"GY","Gordon Yorke: 619-725-7643"]
{"$rows_left_out":1264}
{"sheet":"AC","index":5,"n_rows":1140,"n_cols":3,"rows_kept":1140,"hidden":true}
["Account","Account","Long Descr"]
["0000",{"$f":"VALUE(A2)","v":0},"All Accounts"]
["0341",{"$f":"VALUE(A3)","v":341},"SD Millennial Tech Magnet"]
["1000",1000,"Certificated Salaries"]
["1100",1100,"Teachers'  Salaries"]
["1101",1101,"Teacher/Childrens Center"]
["1103",1103,"Teacher/Clsrm/Preschool"]
["1107",1107,"Classroom Teacher"]
["1109",1109,"Pull/Out Push In"]
["1113",1113,"Teacher/Clsrm/GATE"]
["1114",1114,"Enrollment Reserve"]
["1118",1118,"Prep Time Teacher Allocation"]
["1128",1128,"Resource Specialist"]
["1132",1132,"Master/Lead Teacher"]
["1136",1136,"Lv of Absence NonPay Status"]
["1147",1147,"Clsrm Cert Salry Undist Contra"]
["1150",1150,"Teacher Asst/Clsrm/Hrly"]
["1151",1151,"Teacher/Childrens Ctr/Hrly"]
["1152",1152,"Extended Day Pay Per Unit"]
["1153",1153,"Tchr/Clsrm/Preschool/Hrly"]
["1154",1154,"Enrollment Reserve"]
["1157",1157,"Classroom Teacher Hrly"]
["1158",1158,"Techer/Clsrm/Ext Day/ROTC"]
["1159",1159,"PullOut/Push in Hrly"]
["1160",1160,"Student Teacher Supv"]
["1161",1161,"Sub In Lieu of Overformula"]
["1162",1162,"Short Term Leave Visiting Tchr"]
["1163",1163,"Long Term Leave Visiting Tchr"]
["1164",1164,"Teacher/ClsrmSuper/Hrly"]
["1165",1165,"Jury & Berevmnt Visiting Tchr"]
["1168",1168,"Tchr/Elem/PrepTime/Hrly"]
["1170",1170,"Prof&Curriclm DevHrlyClsrmTchr"]
["1171",1171,"Hourly Tutorial Assignment"]
["1178",1178,"Resource Specialist Hrly"]
["1182",1182,"Master Lead Tchr/Hrly"]
["1186",1186,"Other Cert/Ret/Consultant/Cl"]
["1187",1187,"Adult Ed/Hrly"]
["1189",1189,"Retired Clsrm Teacher Hrly"]
["1192",1192,"Prof&Curriclm Dev Vist Tchr"]
["1197",1197,"Clsrm Cert Hrly Undist/Contra"]
["1200",1200,"Certificated Pupil Support Sal"]
["1201",1201,"Librarian"]
["1202",1202,"Principal/Special Assign/Cert"]
["1203",1203,"Vice-Principal/School Site"]
["1204",1204,"Vice Principal/Spec Assign/Cer"]
["1206",1206,"OCILE Administrator"]
["1208",1208,"Charter School Admin/Cert"]
["1210",1210,"Counselor"]
["1220",1220,"Psychologist"]
["1230",1230,"Audiologist/Audiometrist"]
["1240",1240,"Nurse"]
["1251",1251,"Librarian Hrly"]
["1253",1253,"Vice-Principal/Sch. Site/Hrly"]
["1258",1258,"Charter School/Admin/Hrly"]
["1260",1260,"Counselor Hrly"]
["1262",1262,"Nurse/Counslr/Psychologist Sub"]
["1270",1270,"Psychologist Hrly"]
["1280",1280,"Audiologist/Audiometrist Hrly"]
["1290",1290,"Nurse Hrly"]
["1300",1300,"Cert Super and Admin Sal"]
["1301",1301,"Superintendent"]
["1302",1302,"Chief SIO/Depty Superintdnt"]
["1303",1303,"Coordinator/Cert"]
["1305",1305,"Chief/Exec/Dir/Admin (Rep)"]
["1306",1306,"Chief/Exec/Dir/Admin(Non-Rep)"]
["1307",1307,"Assistant Director/Cert"]
["1308",{"$f":"VALUE(A67)","v":1308},"School Principal"]
["1309",1309,"Vice-Principal"]
["1311",1311,"Manager"]
["1313",1313,"Other Admin Cert"]
["1315",1315,"Admin On Special Assignment"]
["1321",1321,"Director"]
["1358",1358,"Principal Hrly"]
["1359",1359,"Vice-Principal Hrly"]
["1361",1361,"Manager/Admin Hrly"]
["1363",1363,"Administrator/Cert/Hrl"]
["1365",1365,"Admin/Spec Assign/Hrly"]
["1386",1386,"Retired Admin Hrly"]
["1401",1401,"Librarian/Cert"]
["1451",1451,"Librarian/Cert/Hrly"]
{"$rows_left_out":1060}